Reaction Details
TargetGamma-aminobutyric acid receptor subunit alpha-3
LigandBDBM50032973
Substrate/Competitorn/a
Ki 5500±n/a nM
CommentsPDSP_3517
Citation Chebib, MVandenberg, RJFroestl, WJohnston, GA Unsaturated phosphinic analogues of gamma-aminobutyric acid as GABA(C) receptor antagonists. Eur J Pharmacol329:223-9 (1997) Gamma-aminobutyric acid receptor subunit alpha-3
Name:Gamma-aminobutyric acid receptor subunit alpha-3
Type:Enzyme Catalytic Domain
Mol. Mass.:55175.47
Organism:Homo sapiens (Human)
Description:GABA A Alpha3Beta1Gamma2 0 HUMAN::P34903
Residue:492
BDBM50032973
NameBDBM50032973
Synonyms:((Z)-3-Amino-propenyl)-methyl-phosphinic acid CGP44530 CHEMBL109375 | CHEMBL430510
TypeSmall organic molecule
Emp. Form.C4H10NO2P
Mol. Mass.135.1015
SMILESCP(O)(=O)CCC=N