Reaction Details
TargetSomatostatin receptor type 3
LigandBDBM82470
Substrate/Competitorn/a
Ki 63.10±n/a nM
CommentsPDSP_373
Citation Weckbecker, GPally, CRaulf, FBeckmann, NSchuurman, JHRudin, MBruns, C The somatostatin analog octreotide as potential treatment for re-stenosis and chronic rejection. Transplant Proc29:2599-600 (1997) 
 
Somatostatin receptor type 3
Name:Somatostatin receptor type 3
Type:Protein
Mol. Mass.:45855.97
Organism:Homo sapiens (Human)
Description:P32745
Residue:418
BDBM82470
NameBDBM82470
Synonyms:3-(2-Naphtyl)-D-Ala-L-Cys(1)-L-Tyr-D-Trp-L-Lys-L-Val-L-Cys(1)-L-Thr-NH2 BIM-23014 | LANREOTIDE
TypeSmall organic molecule
Emp. Form.C54H69N11O10S2
Mol. Mass.1096.323
SMILESCC(C)[C@@H]1NC(=O)[C@H](CCCCN)NC(=O)[C@@H](Cc2c[nH]c3ccccc23)NC(=O)[C@H](Cc2ccc(O)cc2)NC(=O)[C@H](CSSC[C@H](NC1=O)C(=O)N[C@@H]([C@@H](C)O)C(N)=O)NC(=O)[C@H](N)Cc1ccc2ccccc2c1