Reaction Details
Target5-hydroxytryptamine receptor 7
LigandBDBM85166
Substrate/Competitorn/a
Ki>10000±n/a nM
CommentsPDSP_1666
Citation Price, GWBurton, MJCollin, LJDuckworth, MGaster, LGöthert, MJones, BJRoberts, CWatson, JMMiddlemiss, DN SB-216641 and BRL-15572--compounds to pharmacologically discriminate h5-HT1B and h5-HT1D receptors. Naunyn Schmiedebergs Arch Pharmacol356:312-20 (1997) 
 
5-hydroxytryptamine receptor 7
Name:5-hydroxytryptamine receptor 7
Type:G Protein-Coupled Receptor (GPCR)
Mol. Mass.:53573.08
Organism:Homo sapiens (Human)
Description:P34969
Residue:479
BDBM85166
NameBDBM85166
Synonyms:CAS_3292447 SB 216641
TypeSmall organic molecule
Emp. Form.C28H30N4O4
Mol. Mass.486.5622
SMILESCOc1ccc(NC(=O)c2ccc(cc2)-c2ccc(cc2C)-c2noc(C)n2)cc1OCCN(C)C