Reaction Details
Target5-hydroxytryptamine receptor 4
LigandBDBM50007871
Substrate/Competitorn/a
Ki 199.52±n/a nM
CommentsPDSP_1919
Citation Van den Wyngaert, IGommeren, WVerhasselt, PJurzak, MLeysen, JLuyten, WBender, E Cloning and expression of a human serotonin 5-HT4 receptor cDNA. J Neurochem69:1810-9 (1997) 
 
5-hydroxytryptamine receptor 4
Name:5-hydroxytryptamine receptor 4
Type:Enzyme
Mol. Mass.:43767.54
Organism:Homo sapiens (Human)
Description:Q13639
Residue:388
BDBM50007871
NameBDBM50007871
Synonyms:CHEMBL8197 TROPISETRON
TypeSmall organic molecule
Emp. Form.C17H20N2O2
Mol. Mass.284.3529
SMILESCN1C2CCC1CC(C2)OC(=O)c1c[nH]c2ccccc12