Reaction Details
TargetGamma-aminobutyric acid receptor subunit alpha-3
LigandBDBM50000693
Substrate/Competitorn/a
Ki 2818.38±n/a nM
CommentsPDSP_365
Citation Ebert, BThompson, SASaounatsou, KMcKernan, RKrogsgaard-Larsen, PWafford, KA Differences in agonist/antagonist binding affinity and receptor transduction using recombinant human gamma-aminobutyric acid type A receptors. Mol Pharmacol52:1150-6 (1997) Gamma-aminobutyric acid receptor subunit alpha-3
Name:Gamma-aminobutyric acid receptor subunit alpha-3
Type:Enzyme Catalytic Domain
Mol. Mass.:55175.47
Organism:Homo sapiens (Human)
Description:GABA A Alpha3Beta1Gamma2 0 HUMAN::P34903
Residue:492
BDBM50000693
NameBDBM50000693
Synonyms:(R)-6-((S)-6-Methyl-5,6,7,8-tetrahydro-[1,3]dioxolo[4,5-g]isoquinolin-5-yl)-6H-furo[3',4':3,4]benzo[1,2-d][1,3]dioxol-8-one (bicuculline) 6-Methyl-5-(8-oxo-6,8-dihydro-furo[3',4':3,4]benzo[1,2-d][1,3]dioxol-6-yl)-5,6,7,8-tetrahydro-[1,3]dioxolo[4,5-g]isoquinolin-6-ium 6-(6-Methyl-5,6,7,8-tetrahydro-[1,3]dioxolo[4,5-g]isoquinolin-5-yl)-6H-furo[3',4':3,4]benzo[1,2-d][1,3]dioxol-8-one (Bicuculline) Bicuculline,(+) bicuculline
TypeSmall organic molecule
Emp. Form.C20H17NO6
Mol. Mass.367.3521
SMILESCN1CCc2cc3OCOc3cc2[C@H]1[C@@H]1OC(=O)c2c1ccc1OCOc21