Reaction Details
TargetGamma-aminobutyric acid receptor subunit alpha-3
LigandBDBM50000687
Substrate/Competitorn/a
Ki 34.67±n/a nM
CommentsPDSP_1758
Citation Ebert, BThompson, SASaounatsou, KMcKernan, RKrogsgaard-Larsen, PWafford, KA Differences in agonist/antagonist binding affinity and receptor transduction using recombinant human gamma-aminobutyric acid type A receptors. Mol Pharmacol52:1150-6 (1997) Gamma-aminobutyric acid receptor subunit alpha-3
Name:Gamma-aminobutyric acid receptor subunit alpha-3
Type:Enzyme Catalytic Domain
Mol. Mass.:55175.47
Organism:Homo sapiens (Human)
Description:GABA A Alpha3Beta1Gamma2 0 HUMAN::P34903
Residue:492
BDBM50000687
NameBDBM50000687
Synonyms:2-(3-Carboxy-propyl)-6-(4-methoxy-phenyl)-2H-pyridazin-3-ylidene-ammonium; bromide(gabazine) 6-Amino-1-(3-carboxy-propyl)-3-(4-methoxy-phenyl)-pyridazin-1-ium; bromide SR 95531
TypeSmall organic molecule
Emp. Form.C15H18N3O3
Mol. Mass.288.3212
SMILESCOc1ccc(cc1)-c1ccc(=[NH2+])n(CCCC(O)=O)n1