Reaction Details
TargetSodium-dependent serotonin transporter
LigandBDBM35229
Substrate/Competitorn/a
Ki 22±n/a nM
CommentsPDSP_638
Citation Owens, MJMorgan, WNPlott, SJNemeroff, CB Neurotransmitter receptor and transporter binding profile of antidepressants and their metabolites. J Pharmacol Exp Ther283:1305-22 (1997) Sodium-dependent serotonin transporter
Name:Sodium-dependent serotonin transporter
Type:Multi-pass membrane protein
Mol. Mass.:70322.51
Organism:Homo sapiens (Human)
Description:P31645
Residue:630
BDBM35229
NameBDBM35229
Synonyms:3-(10,11-dihydro-5H-dibenzo[b,f]azepin-5-yl)-N-methylpropan-1-amine CHEMBL72 DMI Desipramine N-(3-methylaminopropyl)iminobibenzyl demethylimipramine norimipramine
TypeSmall organic molecule
Emp. Form.C18H22N2
Mol. Mass.266.3807
SMILESCNCCCN1c2ccccc2CCc2ccccc12