Reaction Details
TargetSodium-dependent serotonin transporter
LigandBDBM85197
Substrate/Competitorn/a
Ki>10000±n/a nM
CommentsPDSP_1907
Citation Owens, MJMorgan, WNPlott, SJNemeroff, CB Neurotransmitter receptor and transporter binding profile of antidepressants and their metabolites. J Pharmacol Exp Ther283:1305-22 (1997) Sodium-dependent serotonin transporter
Name:Sodium-dependent serotonin transporter
Type:Multi-pass membrane protein
Mol. Mass.:70168.43
Organism:Rattus norvegicus (rat)
Description:P31652
Residue:630
BDBM85197
NameBDBM85197
Synonyms:Triazoledione
TypeSmall organic molecule
Emp. Form.C23H28ClN5O3
Mol. Mass.457.953
SMILESClc1cccc(c1)N1CCN(CCCn2[nH]c(=O)n(CCOc3ccccc3)c2=O)CC1