Reaction Details
Target5-hydroxytryptamine receptor 2A
LigandBDBM30130
Substrate/Competitorn/a
Ki 141±n/a nM
CommentsPDSP_830
Citation Owens, MJMorgan, WNPlott, SJNemeroff, CB Neurotransmitter receptor and transporter binding profile of antidepressants and their metabolites. J Pharmacol Exp Ther283:1305-22 (1997) 5-hydroxytryptamine receptor 2A
Name:5-hydroxytryptamine receptor 2A
Type:G Protein-Coupled Receptor (GPCR)
Mol. Mass.:52852.05
Organism:Rattus norvegicus (rat)
Description:Rat cortex membranes 5-HT2A receptors.
Residue:471
BDBM30130
NameBDBM30130
Synonyms:CHEMBL1201082 Fluoxetin Prozac cid_62857
TypeSmall organic molecule
Emp. Form.C17H18F3NO
Mol. Mass.309.3261
SMILESCNCCC(Oc1ccc(cc1)C(F)(F)F)c1ccccc1