Reaction Details
TargetHistamine H1 receptor
LigandBDBM50069447
Substrate/Competitorn/a
Ki 30±n/a nM
CommentsPDSP_1303
Citation Owens, MJMorgan, WNPlott, SJNemeroff, CB Neurotransmitter receptor and transporter binding profile of antidepressants and their metabolites. J Pharmacol Exp Ther283:1305-22 (1997) Histamine H1 receptor
Name:Histamine H1 receptor
Type:G Protein-Coupled Receptor (GPCR)
Mol. Mass.:55641.53
Organism:Cavia porcellus (domestic guinea pig)
Description:Guinea pig cerebellum was used in binding assay.
Residue:488
BDBM50069447
NameBDBM50069447
Synonyms:1-(3-(4-(m-Chlorophenyl)-1-piperazinyl)propyl)-3-ethyl-4-(2-phenoxyethyl)-delta2-1,2,4-triazolin-5-one CHEMBL623 US9138393, Nefazodone HCl | US9144538, Nefazodone HCl
TypeSmall organic molecule
Emp. Form.C25H32ClN5O2
Mol. Mass.470.007
SMILESCCc1nn(CCCN2CCN(CC2)c2cccc(Cl)c2)c(=O)n1CCOc1ccccc1