Reaction Details
TargetSodium-dependent noradrenaline transporter
LigandBDBM50001915
Substrate/Competitorn/a
Ki 4360±n/a nM
CommentsPDSP_1168
Citation Owens, MJMorgan, WNPlott, SJNemeroff, CB Neurotransmitter receptor and transporter binding profile of antidepressants and their metabolites. J Pharmacol Exp Ther283:1305-22 (1997) Sodium-dependent noradrenaline transporter
Name:Sodium-dependent noradrenaline transporter
Type:Multi-pass membrane protein
Mol. Mass.:69337.72
Organism:Homo sapiens (Human)
Description:P23975
Residue:617
BDBM50001915
NameBDBM50001915
Synonyms:1-(3-chlorophenyl)piperazine m-Chlorophenylpiperazine | mCPP
TypeSmall organic molecule
Emp. Form.C10H13ClN2
Mol. Mass.196.677
SMILESClc1cccc(c1)N1CCNCC1