Reaction Details
TargetGalanin receptor type 2
LigandBDBM85200
Substrate/Competitorn/a
Ki 4.7±n/a nM
CommentsPDSP_857
Citation Wang, SHe, CHashemi, TBayne, M Cloning and expressional characterization of a novel galanin receptor. Identification of different pharmacophores within galanin for the three galanin receptor subtypes. J Biol Chem272:31949-52 (1997) 
 
Galanin receptor type 2
Name:Galanin receptor type 2
Type:Enzyme Catalytic Domain
Mol. Mass.:40697.04
Organism:RAT
Description:Galanin R2 GALR2 RAT::O08726
Residue:372
BDBM85200
NameBDBM85200
Synonyms:Galanin (1-19), rat | Galanin rat
TypeSmall organic molecule
Emp. Form.C92H135N27O26
Mol. Mass.2035.2216
SMILESCCC(C)C(NC(=O)C(C)NC(=O)C(Cc1cnc[nH]1)NC(=O)C1CCCN1C(=O)CNC(=O)C(CC(C)C)NC(=O)C(CC(C)C)NC(=O)C(Cc1ccc(O)cc1)NC(=O)CNC(=O)C(C)NC(=O)C(CO)NC(=O)C(CC(N)=O)NC(=O)C(CC(C)C)NC(=O)C(NC(=O)C(Cc1c[nH]c2ccccc12)NC(=O)CN)C(C)O)C(=O)NC(CC(O)=O)C(=O)NC(CC(N)=O)C(=O)NC(Cc1cnc[nH]1)C(N)=O