Reaction Details
TargetMuscarinic acetylcholine receptor M2
LigandBDBM50149891
Substrate/Competitorn/a
Ki 2610±n/a nM
CommentsPDSP_866
Citation Kovacs, IYamamura, HIWaite, SLVarga, EVRoeske, WR Pharmacological comparison of the cloned human and rat M2 muscarinic receptor genes expressed in the murine fibroblast (B82) cell line. J Pharmacol Exp Ther284:500-7 (1998) Muscarinic acetylcholine receptor M2
Name:Muscarinic acetylcholine receptor M2
Type:Enzyme Catalytic Domain
Mol. Mass.:51555.53
Organism:RAT
Description:P10980
Residue:466
BDBM50149891
NameBDBM50149891
Synonyms:2,2',2''-[1,2,3-BENZENE-TRIYLTRIS(OXY)]TRIS[N,N,N-TRIETHYLETHANAMINIUM] GALLAMINE
TypeSmall organic molecule
Emp. Form.C30H60N3O3
Mol. Mass.510.8141
SMILESCC[N+](CC)(CC)CCOc1cccc(OCC[N+](CC)(CC)CC)c1OCC[N+](CC)(CC)CC