Reaction Details
TargetMuscarinic acetylcholine receptor M2
LigandBDBM50018550
Substrate/Competitorn/a
Ki>10000±n/a nM
CommentsPDSP_1069
Citation Kovacs, IYamamura, HIWaite, SLVarga, EVRoeske, WR Pharmacological comparison of the cloned human and rat M2 muscarinic receptor genes expressed in the murine fibroblast (B82) cell line. J Pharmacol Exp Ther284:500-7 (1998) Muscarinic acetylcholine receptor M2
Name:Muscarinic acetylcholine receptor M2
Type:Enzyme Catalytic Domain
Mol. Mass.:51555.53
Organism:RAT
Description:P10980
Residue:466
BDBM50018550
NameBDBM50018550
Synonyms:1'-Benzyl-3-phenyl-[3,4']bipiperidinyl-2,6-dione Dexetimide | Levetimide
TypeSmall organic molecule
Emp. Form.C23H26N2O2
Mol. Mass.362.4647
SMILESO=C1CC[C@](C2CCN(Cc3ccccc3)CC2)(C(=O)N1)c1ccccc1