Reaction Details
TargetAdenosine receptor A1
LigandBDBM50115630
Substrate/Competitorn/a
Ki 5.9±n/a nM
CommentsPDSP_2623
Citation Camaioni, EDi Francesco, EVittori, SVolpini, RCristalli, G Adenosine receptor agonists: synthesis and biological evaluation of the diastereoisomers of 2-(3-hydroxy-3-phenyl-1-propyn-1-yl)NECA. Bioorg Med Chem5:2267-75 (1997) 
 
Adenosine receptor A1
Name:Adenosine receptor A1
Type:Protein
Mol. Mass.:36704.13
Organism:Rattus norvegicus (rat)
Description:n/a
Residue:326
BDBM50115630
NameBDBM50115630
Synonyms:(2S,3R,4S)-5-[6-amino-2-(3-hydroxy-3-phenylprop-1-yn-1-yl)-9H-purin-9-yl]-N-ethyl-3,4-dihydroxyoxolane-2-carboxamide R-PHPNECA
TypeSmall organic molecule
Emp. Form.C21H22N6O5
Mol. Mass.438.4366
SMILESCCNC(=O)[C@H]1OC([C@@H](O)[C@H]1O)n1cnc2c(N)nc(nc12)C#CC(O)c1ccccc1