Reaction Details
TargetMetabotropic glutamate receptor 2
LigandBDBM85077
Substrate/Competitorn/a
Ki>10000±n/a nM
CommentsPDSP_2027
Citation Schaffhauser, HRichards, JGCartmell, JChaboz, SKemp, JAKlingelschmidt, AMesser, JStadler, HWoltering, TMutel, V In vitro binding characteristics of a new selective group II metabotropic glutamate receptor radioligand, [3H]LY354740, in rat brain. Mol Pharmacol53:228-33 (1998) Metabotropic glutamate receptor 2
Name:Metabotropic glutamate receptor 2
Type:Enzyme
Mol. Mass.:95584.88
Organism:Homo sapiens (Human)
Description:Q14416
Residue:872
BDBM85077
NameBDBM85077
Synonyms:3-Phosphono-D,L-2-aminopropionic acid, 7 L-AP3 | NSC_3857
TypeSmall organic molecule
Emp. Form.C3H8NO5P
Mol. Mass.169.0731
SMILESNC(CP(O)(O)=O)C(O)=O