Reaction Details
TargetMetabotropic glutamate receptor 2
LigandBDBM50030627
Substrate/Competitorn/a
Ki>10000±n/a nM
CommentsPDSP_2028
Citation Schaffhauser, HRichards, JGCartmell, JChaboz, SKemp, JAKlingelschmidt, AMesser, JStadler, HWoltering, TMutel, V In vitro binding characteristics of a new selective group II metabotropic glutamate receptor radioligand, [3H]LY354740, in rat brain. Mol Pharmacol53:228-33 (1998) Metabotropic glutamate receptor 2
Name:Metabotropic glutamate receptor 2
Type:Enzyme
Mol. Mass.:95584.88
Organism:Homo sapiens (Human)
Description:Q14416
Residue:872
BDBM50030627
NameBDBM50030627
Synonyms:(+-)-MCPG 4-(1-Amino-1-carboxy-ethyl)-benzoic acid CHEMBL299683 | MCPG
TypeSmall organic molecule
Emp. Form.C10H11NO4
Mol. Mass.209.1986
SMILESCC(N)(C(O)=O)c1ccc(cc1)C(O)=O