Reaction Details
TargetGlutamate receptor 3
LigandBDBM50060635
Substrate/Competitorn/a
Ki>10000±n/a nM
CommentsPDSP_829
Citation Varney, MARao, SPJachec, CDeal, CHess, SDDaggett, LPLin, FJohnson, ECVeliçelebi, G Pharmacological characterization of the human ionotropic glutamate receptor subtype GluR3 stably expressed in mammalian cells. J Pharmacol Exp Ther285:358-70 (1998) Glutamate receptor 3
Name:Glutamate receptor 3
Type:PROTEIN
Mol. Mass.:101172.14
Organism:Homo sapiens (Human)
Description:ChEMBL_468627
Residue:894
BDBM50060635
NameBDBM50060635
Synonyms:(S)-2-Amino-3-(5-fluoro-2,4-dioxo-3,4-dihydro-2H-pyrimidin-1-yl)-propionic acid (S)-5-Fluorowillardiine CHEMBL123132 | Fluorowillardiine
TypeSmall organic molecule
Emp. Form.C7H8FN3O4
Mol. Mass.217.1545
SMILESN[C@@H](Cn1cc(F)c(=O)[nH]c1=O)C(O)=O