Reaction Details
TargetGlutamate receptor 3
LigandBDBM50048389
Substrate/Competitorn/a
Ki>10000±n/a nM
CommentsPDSP_917
Citation Varney, MARao, SPJachec, CDeal, CHess, SDDaggett, LPLin, FJohnson, ECVeliçelebi, G Pharmacological characterization of the human ionotropic glutamate receptor subtype GluR3 stably expressed in mammalian cells. J Pharmacol Exp Ther285:358-70 (1998) Glutamate receptor 3
Name:Glutamate receptor 3
Type:Enzyme Catalytic Domain
Mol. Mass.:100383.57
Organism:RAT
Description:Glutamate-AMPA GRIA3 RAT::P19492
Residue:888
BDBM50048389
NameBDBM50048389
Synonyms:4-(8-Methyl-9H-1,3-dioxa-6,7-diaza-cyclohepta[f]inden-5-yl)-phenylamine CHEMBL275006 | GYKI-52466
TypeSmall organic molecule
Emp. Form.C17H15N3O2
Mol. Mass.293.3199
SMILESCC1=NN=C(c2ccc(N)cc2)c2cc3OCOc3cc2C1