Reaction Details
TargetGlutamate receptor 3
LigandBDBM50002369
Substrate/Competitorn/a
Ki 5780±n/a nM
CommentsPDSP_1011
Citation Varney, MARao, SPJachec, CDeal, CHess, SDDaggett, LPLin, FJohnson, ECVeliçelebi, G Pharmacological characterization of the human ionotropic glutamate receptor subtype GluR3 stably expressed in mammalian cells. J Pharmacol Exp Ther285:358-70 (1998) Glutamate receptor 3
Name:Glutamate receptor 3
Type:Enzyme Catalytic Domain
Mol. Mass.:100383.57
Organism:RAT
Description:Glutamate-AMPA GRIA3 RAT::P19492
Residue:888
BDBM50002369
NameBDBM50002369
Synonyms:(2S-(2alpha,3beta,4beta))-2-carboxy-4-(1-methylethenyl)-3-pyrrolidineacetic acid CHEMBL275040 Digensaeure Kainate L-alpha-kainic acid digenic acid | kainic acid
TypeSmall organic molecule
Emp. Form.C10H15NO4
Mol. Mass.213.2304
SMILESCC(=C)[C@H]1CN[C@@H]([C@H]1CC(O)=O)C(O)=O