Reaction Details
TargetSodium-dependent serotonin transporter
LigandBDBM82548
Substrate/Competitorn/a
Ki 8.6±n/a nM
CommentsPDSP_4623
Citation Tatsumi, MGroshan, KBlakely, RDRichelson, E Pharmacological profile of antidepressants and related compounds at human monoamine transporters. Eur J Pharmacol340:249-58 (1997) 
 
Sodium-dependent serotonin transporter
Name:Sodium-dependent serotonin transporter
Type:Multi-pass membrane protein
Mol. Mass.:70322.51
Organism:Homo sapiens (Human)
Description:P31645
Residue:630
BDBM82548
NameBDBM82548
Synonyms:CAS_897-15-4 NSC_3155
TypeSmall organic molecule
Emp. Form.C19H21NS
Mol. Mass.295.442
SMILESCN(C)CCC=C1c2ccccc2CSc2ccccc12