Reaction Details
TargetSodium-dependent serotonin transporter
LigandBDBM50240410
Substrate/Competitorn/a
Ki 149±n/a nM
CommentsPDSP_1914
Citation Tatsumi, MGroshan, KBlakely, RDRichelson, E Pharmacological profile of antidepressants and related compounds at human monoamine transporters. Eur J Pharmacol340:249-58 (1997) 
 
Sodium-dependent serotonin transporter
Name:Sodium-dependent serotonin transporter
Type:Multi-pass membrane protein
Mol. Mass.:70322.51
Organism:Homo sapiens (Human)
Description:P31645
Residue:630
BDBM50240410
NameBDBM50240410
Synonyms:10,11-dihydro-N,N,beta-trimethyl-5H-dibenz[b,f]azepine-5-propanamine 5-(gamma-dimethylamino-beta-methylpropyl)-10,11-dihydro-5H-dibenzo[b,f]azepine CHEMBL644 Sapilent Trimeprimine trimeproprimine
TypeSmall organic molecule
Emp. Form.C20H26N2
Mol. Mass.294.4338
SMILESCC(CN(C)C)CN1c2ccccc2CCc2ccccc12