Reaction Details
TargetSodium-dependent dopamine transporter
LigandBDBM50028066
Substrate/Competitorn/a
Ki 129±n/a nM
CommentsPDSP_639
Citation Tatsumi, MGroshan, KBlakely, RDRichelson, E Pharmacological profile of antidepressants and related compounds at human monoamine transporters. Eur J Pharmacol340:249-58 (1997) 
 
Sodium-dependent dopamine transporter
Name:Sodium-dependent dopamine transporter
Type:Multi-pass membrane protein
Mol. Mass.:68497.11
Organism:Homo sapiens (Human)
Description:Q01959
Residue:620
BDBM50028066
NameBDBM50028066
Synonyms:4-(3,4-Dichloro-phenyl)-1,2,3,4-tetrahydro-naphthalen-1-ylamine, HCl Desmethylsertraline
TypeSmall organic molecule
Emp. Form.C16H15Cl2N
Mol. Mass.292.203
SMILESN[C@H]1CC[C@@H](c2ccc(Cl)c(Cl)c2)c2ccccc12