Reaction Details
TargetSodium-dependent dopamine transporter
LigandBDBM50028091
Substrate/Competitorn/a
Ki 9200±n/a nM
CommentsPDSP_844
Citation Tatsumi, MGroshan, KBlakely, RDRichelson, E Pharmacological profile of antidepressants and related compounds at human monoamine transporters. Eur J Pharmacol340:249-58 (1997) 
 
Sodium-dependent dopamine transporter
Name:Sodium-dependent dopamine transporter
Type:Multi-pass membrane protein
Mol. Mass.:68497.11
Organism:Homo sapiens (Human)
Description:Q01959
Residue:620
BDBM50028091
NameBDBM50028091
Synonyms:(1E)-5-methoxy-1-[4-(trifluoromethyl)phenyl]pentan-1-one O-(2-aminoethyl)oxime FLUVOXAMINE
TypeSmall organic molecule
Emp. Form.C15H21F3N2O2
Mol. Mass.318.3346
SMILESCOCCCC\C(=N/OCCN)c1ccc(cc1)C(F)(F)F