Reaction Details
TargetSodium-dependent dopamine transporter
LigandBDBM50005548
Substrate/Competitorn/a
Ki 56±n/a nM
CommentsPDSP_1347
Citation Tatsumi, MGroshan, KBlakely, RDRichelson, E Pharmacological profile of antidepressants and related compounds at human monoamine transporters. Eur J Pharmacol340:249-58 (1997) 
 
Sodium-dependent dopamine transporter
Name:Sodium-dependent dopamine transporter
Type:Multi-pass membrane protein
Mol. Mass.:68497.11
Organism:Homo sapiens (Human)
Description:Q01959
Residue:620
BDBM50005548
NameBDBM50005548
Synonyms:(+)-2-Methyl-4-phenyl-1,2,3,4-tetrahydro-isoquinolin-8-ylamine (-)-2-Methyl-4-phenyl-1,2,3,4-tetrahydro-isoquinolin-8-ylamine 2-Methyl-4-phenyl-1,2,3,4-tetrahydro-isoquinolin-8-ylamine 2-Methyl-4-phenyl-1,2,3,4-tetrahydro-isoquinolin-8-ylamine(Nomifensine) CHEMBL273575 NOMIFENSINE2-Methyl-4-phenyl-1,2,3,4-tetrahydro-isoquinolin-8-ylamine
TypeSmall organic molecule
Emp. Form.C16H18N2
Mol. Mass.238.3275
SMILESCN1CC(c2ccccc2)c2cccc(N)c2C1