Reaction Details
TargetGlutamate receptor ionotropic, NMDA 1
LigandBDBM79403
Substrate/Competitorn/a
Ki 2000±n/a nM
CommentsPDSP_3015
Citation Mutel, VBuchy, DKlingelschmidt, AMesser, JBleuel, ZKemp, JARichards, JG In vitro binding properties in rat brain of [3H]Ro 25-6981, a potent and selective antagonist of NMDA receptors containing NR2B subunits. J Neurochem70:2147-55 (1998) 
 
Glutamate receptor ionotropic, NMDA 1
Name:Glutamate receptor ionotropic, NMDA 1
Type:Enzyme Catalytic Domain
Mol. Mass.:105533.40
Organism:RAT
Description:P35439
Residue:938
BDBM79403
NameBDBM79403
Synonyms:3-aminopropyl-[4-(3-aminopropylamino)butyl]amine;hydrochloride MLS002472980 N,N''-bis(3-azanylpropyl)butane-1,4-diamine;hydrochloride SMR001397086 cid_5351186 | spermidine 3HCl
TypeSmall organic molecule
Emp. Form.C10H26N4
Mol. Mass.202.3402