Reaction Details
Target5-hydroxytryptamine receptor 2A
LigandBDBM78433
Substrate/Competitorn/a
Ki 3.2±n/a nM
CommentsPDSP_837
Citation Seeman, PTallerico, T Antipsychotic drugs which elicit little or no parkinsonism bind more loosely than dopamine to brain D2 receptors, yet occupy high levels of these receptors. Mol Psychiatry3:123-34 (1998) 
 
5-hydroxytryptamine receptor 2A
Name:5-hydroxytryptamine receptor 2A
Type:undefined
Mol. Mass.:52607.65
Organism:Homo sapiens (Human)
Description:P28223
Residue:471
BDBM78433
NameBDBM78433
Synonyms:2-[4-[3-[2-(trifluoromethyl)-10-phenothiazinyl]propyl]-1-piperazinyl]ethanol;hydrochloride 2-[4-[3-[2-(trifluoromethyl)phenothiazin-10-yl]propyl]piperazino]ethanol;hydrochloride FLUPHENAZINE HYDROCHLORIDE SMR000058411 cid_6602611 | med.21724, Compound 17
TypeSmall organic molecule
Emp. Form.C22H26F3N3OS
Mol. Mass.437.522
SMILESOCCN1CCN(CCCN2c3ccccc3Sc3ccc(cc23)C(F)(F)F)CC1