Reaction Details
Target5-hydroxytryptamine receptor 2A
LigandBDBM50034043
Substrate/Competitorn/a
Ki 0.12±n/a nM
CommentsPDSP_964
Citation Seeman, PTallerico, T Antipsychotic drugs which elicit little or no parkinsonism bind more loosely than dopamine to brain D2 receptors, yet occupy high levels of these receptors. Mol Psychiatry3:123-34 (1998) 
 
5-hydroxytryptamine receptor 2A
Name:5-hydroxytryptamine receptor 2A
Type:undefined
Mol. Mass.:52607.65
Organism:Homo sapiens (Human)
Description:P28223
Residue:471
BDBM50034043
NameBDBM50034043
Synonyms:1-(4-{3-[4-(6-Fluoro-benzo[d]isoxazol-3-yl)-piperidin-1-yl]-propoxy}-3-methoxy-phenyl)-ethanone ILOPERIDONE
TypeSmall organic molecule
Emp. Form.C24H27FN2O4
Mol. Mass.426.4806
SMILESCOc1cc(ccc1OCCCN1CCC(CC1)c1noc2cc(F)ccc12)C(C)=O