Reaction Details
TargetD(4) dopamine receptor
LigandBDBM81486
Substrate/Competitorn/a
Ki 2±n/a nM
CommentsPDSP_1249
Citation Seeman, PTallerico, T Antipsychotic drugs which elicit little or no parkinsonism bind more loosely than dopamine to brain D2 receptors, yet occupy high levels of these receptors. Mol Psychiatry3:123-34 (1998) 
 
D(4) dopamine receptor
Name:D(4) dopamine receptor
Type:Enzyme
Mol. Mass.:48373.19
Organism:Homo sapiens (Human)
Description:P21917
Residue:419
BDBM81486
NameBDBM81486
Synonyms:CAS_1050-79-9 NSC_4249
TypeSmall organic molecule
Emp. Form.C22H26FNO2
Mol. Mass.355.4457
SMILESCc1ccc(cc1)C1(O)CCN(CCCC(=O)c2ccc(F)cc2)CC1