Reaction Details
TargetD(4) dopamine receptor
LigandBDBM85222
Substrate/Competitorn/a
Ki 0.3±n/a nM
CommentsPDSP_2605
Citation Seeman, PTallerico, T Antipsychotic drugs which elicit little or no parkinsonism bind more loosely than dopamine to brain D2 receptors, yet occupy high levels of these receptors. Mol Psychiatry3:123-34 (1998) 
 
D(4) dopamine receptor
Name:D(4) dopamine receptor
Type:Enzyme
Mol. Mass.:48373.19
Organism:Homo sapiens (Human)
Description:P21917
Residue:419
BDBM85222
NameBDBM85222
Synonyms:CAS_441351-20-8 SM 13496
TypeSmall organic molecule
Emp. Form.C28H36N4O2S
Mol. Mass.492.676
SMILESO=C1[C@H]2[C@@H]3CC[C@@H](C3)[C@H]2C(=O)N1C[C@@H]1CCCC[C@H]1CN1CCN(CC1)c1nsc2ccccc12