Reaction Details
TargetNeuronal acetylcholine receptor subunit alpha-4
LigandBDBM50035398
Substrate/Competitorn/a
Ki 1.7±n/a nM
CommentsPDSP_222
Citation Whiteaker, PSharples, CGWonnacott, S Agonist-induced up-regulation of alpha4beta2 nicotinic acetylcholine receptors in M10 cells: pharmacological and spatial definition. Mol Pharmacol53:950-62 (1998) Neuronal acetylcholine receptor subunit alpha-4
Name:Neuronal acetylcholine receptor subunit alpha-4
Type:n/a
Mol. Mass.:69963.49
Organism:Homo sapiens (Human)
Description:NACHRA4
Residue:627
BDBM50035398
NameBDBM50035398
Synonyms:(S)-1-Methyl-2-(3-methyl-isoxazol-5-yl)-pyrrolidinium 3-Methyl-5-((S)-1-methyl-pyrrolidin-2-yl)-isoxazole CHEMBL274525
TypeSmall organic molecule
Emp. Form.C9H14N2O
Mol. Mass.166.2203
SMILESCN1CCC[C@H]1c1cc(C)no1