Reaction Details
TargetSomatostatin receptor type 5
LigandBDBM82253
Substrate/Competitorn/a
Ki 1.22±n/a nM
CommentsPDSP_382
Citation Meyerhof, W The elucidation of somatostatin receptor functions: a current view. Rev Physiol Biochem Pharmacol133:55-108 (1998) 
 
Somatostatin receptor type 5
Name:Somatostatin receptor type 5
Type:Enzyme
Mol. Mass.:39218.02
Organism:Homo sapiens (Human)
Description:P35346
Residue:364
BDBM82253
NameBDBM82253
Synonyms:BIM 23052 | CAS_133073-82-2
TypeSmall organic molecule
Emp. Form.C61H75N11O10
Mol. Mass.1122.3159
SMILESC[C@@H](O)[C@H](NC(=O)[C@H](Cc1ccccc1)NC(=O)[C@@H](NC(=O)[C@H](CCCCN)NC(=O)[C@@H](Cc1c[nH]c2ccccc12)NC(=O)[C@H](Cc1ccccc1)NC(=O)[C@H](Cc1ccccc1)NC(=O)[C@H](N)Cc1ccccc1)[C@@H](C)O)C(N)=O