Reaction Details
TargetSomatostatin receptor type 5
LigandBDBM85229
Substrate/Competitorn/a
Ki 0.34±n/a nM
CommentsPDSP_3570
Citation Meyerhof, W The elucidation of somatostatin receptor functions: a current view. Rev Physiol Biochem Pharmacol133:55-108 (1998) 
 
Somatostatin receptor type 5
Name:Somatostatin receptor type 5
Type:Enzyme
Mol. Mass.:39218.02
Organism:Homo sapiens (Human)
Description:P35346
Residue:364
BDBM85229
NameBDBM85229
Synonyms:BIM 23295
TypeSmall organic molecule
Emp. Form.C54H69N11O10S2
Mol. Mass.1096.323
SMILESCC(O)[C@@H](NC(=O)[C@H](CCCCN)NC(=O)[C@@H](Cc1c[nH]c2ccccc12)NC(=O)[C@H](Cc1ccc(O)cc1)NC(=O)C(Cc1ccccc1)NC(=O)C(N)CS)C(=O)NC(Cc1ccccc1)C(=O)NC(CS)C(N)=O