Reaction Details
TargetMelatonin receptor type 1A
LigandBDBM82509
Substrate/Competitorn/a
Ki 25.11±n/a nM
CommentsPDSP_1199
Citation Beresford, IJBrowning, CStarkey, SJBrown, JFoord, SMCoughlan, JNorth, PCDubocovich, MLHagan, RM GR196429: a nonindolic agonist at high-affinity melatonin receptors. J Pharmacol Exp Ther285:1239-45 (1998) Melatonin receptor type 1A
Name:Melatonin receptor type 1A
Type:Enzyme Catalytic Domain
Mol. Mass.:17908.30
Organism:GUINEA PIG
Description:Melatonin 0 GUINEA PIG::O02781
Residue:154
BDBM82509
NameBDBM82509
Synonyms:Melatonin,6-Hydroxy | melatonin, 6-Hydroxy
TypeSmall organic molecule
Emp. Form.C13H16N2O3
Mol. Mass.248.2777
SMILESCOc1cc2c(CCNC(C)=O)c[nH]c2cc1O