Reaction Details
TargetMelatonin receptor type 1B
LigandBDBM29612
Substrate/Competitorn/a
Ki 301.99±n/a nM
CommentsPDSP_1708
Citation Beresford, IJBrowning, CStarkey, SJBrown, JFoord, SMCoughlan, JNorth, PCDubocovich, MLHagan, RM GR196429: a nonindolic agonist at high-affinity melatonin receptors. J Pharmacol Exp Ther285:1239-45 (1998) Melatonin receptor type 1B
Name:Melatonin receptor type 1B
Type:Enzyme
Mol. Mass.:40203.54
Organism:Homo sapiens (Human)
Description:P49286
Residue:362
BDBM29612
NameBDBM29612
Synonyms:CHEMBL33103 JOH-MSK-a63bdd1d-4 N-Acetyl-5-hydroxytryptamine N-acetylserotonin Serotonin,N-acetyl
TypeSmall organic molecule
Emp. Form.C12H14N2O2
Mol. Mass.218.2518
SMILESCC(=O)NCCc1c[nH]c2ccc(O)cc12