Reaction Details
TargetMelatonin receptor type 1B
LigandBDBM85239
Substrate/Competitorn/a
Ki 0.36±n/a nM
CommentsPDSP_178
Citation Sugden, DPickering, HTeh, MTGarratt, PJ Melatonin receptor pharmacology: toward subtype specificity. Biol Cell89:531-7 (1997) 
 
Melatonin receptor type 1B
Name:Melatonin receptor type 1B
Type:Enzyme
Mol. Mass.:40203.54
Organism:Homo sapiens (Human)
Description:P49286
Residue:362
BDBM85239
NameBDBM85239
Synonyms:5-MeOT-N-propionyl
TypeSmall organic molecule
Emp. Form.C17H23N3O2
Mol. Mass.301.3834
SMILESCCC(=O)NCCc1ccc2[nH]cc(CCNC(C)=O)c2c1