Reaction Details
TargetMelatonin receptor type 1C
LigandBDBM85238
Substrate/Competitorn/a
Ki 0.66±n/a nM
CommentsPDSP_175
Citation Sugden, DPickering, HTeh, MTGarratt, PJ Melatonin receptor pharmacology: toward subtype specificity. Biol Cell89:531-7 (1997) 
 
Melatonin receptor type 1C
Name:Melatonin receptor type 1C
Type:Enzyme Catalytic Domain
Mol. Mass.:47442.40
Organism:Xenopus
Description:Melatonin 1C 0 Xenopus::P49219
Residue:420
BDBM85238
NameBDBM85238
Synonyms:5-MeOT-N-butanyl
TypeSmall organic molecule
Emp. Form.C18H25N3O2
Mol. Mass.315.41
SMILESCCCC(=O)NCCc1ccc2[nH]cc(CCNC(C)=O)c2c1