Reaction Details
TargetProstaglandin G/H synthase 1
LigandBDBM50174201
Substrate/Competitorn/a
Ki 260±n/a nM
CommentsPDSP_3988
Citation Cryer, BFeldman, M Cyclooxygenase-1 and cyclooxygenase-2 selectivity of widely used nonsteroidal anti-inflammatory drugs. Am J Med104:413-21 (1998) 
 
Prostaglandin G/H synthase 1
Name:Prostaglandin G/H synthase 1
Type:Enzyme
Mol. Mass.:68692.62
Organism:Homo sapiens (Human)
Description:P23219
Residue:599
BDBM50174201
NameBDBM50174201
Synonyms:ARTHROTEC SOLARAZE US11173137, Compound Diclofenac VOLTAREN-XR sodium 2-(2-(2,6-dichlorophenylamino)phenyl)acetate
TypeSmall organic molecule
Emp. Form.C14H10Cl2NO2
Mol. Mass.295.141
SMILES[O-]C(=O)Cc1ccccc1Nc1c(Cl)cccc1Cl