Reaction Details
TargetProstaglandin G/H synthase 1
LigandBDBM50074922
Substrate/Competitorn/a
Ki 410±n/a nM
CommentsPDSP_4457
Citation Cryer, BFeldman, M Cyclooxygenase-1 and cyclooxygenase-2 selectivity of widely used nonsteroidal anti-inflammatory drugs. Am J Med104:413-21 (1998) 
 
Prostaglandin G/H synthase 1
Name:Prostaglandin G/H synthase 1
Type:Enzyme
Mol. Mass.:68692.62
Organism:Homo sapiens (Human)
Description:P23219
Residue:599
BDBM50074922
NameBDBM50074922
Synonyms:(+-)-2-fluoro-alpha-methyl-4-biphenylacetic acid 2-(2-fluorobiphenyl-4-yl)propanoic acid 3-fluoro-4-phenylhydratropic acid CHEMBL563 US9630914, Compound A
TypeSmall organic molecule
Emp. Form.C15H13FO2
Mol. Mass.244.2609
SMILESCC(C(O)=O)c1ccc(c(F)c1)-c1ccccc1