Reaction Details
TargetProstaglandin G/H synthase 1
LigandBDBM54707
Substrate/Competitorn/a
Ki>10000±n/a nM
CommentsPDSP_4482
Citation Cryer, BFeldman, M Cyclooxygenase-1 and cyclooxygenase-2 selectivity of widely used nonsteroidal anti-inflammatory drugs. Am J Med104:413-21 (1998) 
 
Prostaglandin G/H synthase 1
Name:Prostaglandin G/H synthase 1
Type:Enzyme
Mol. Mass.:68692.62
Organism:Homo sapiens (Human)
Description:P23219
Residue:599
BDBM54707
NameBDBM54707
Synonyms:2-[(3E)-6-fluoranyl-2-methyl-3-[(4-methylsulfinylphenyl)methylidene]inden-1-yl]ethanoic acid 2-[(3E)-6-fluoro-2-methyl-3-[(4-methylsulfinylphenyl)methylidene]-1-indenyl]acetic acid UNM-0000306136 | cid_1548885
TypeSmall organic molecule
Emp. Form.C20H17FO3S
Mol. Mass.356.411
SMILESCC1=C(CC(O)=O)c2cc(F)ccc2\C1=C\c1ccc(cc1)S(C)=O