Reaction Details
TargetProstaglandin G/H synthase 2
LigandBDBM50016799
Substrate/Competitorn/a
Ki 2470±n/a nM
CommentsPDSP_4451
Citation Cryer, BFeldman, M Cyclooxygenase-1 and cyclooxygenase-2 selectivity of widely used nonsteroidal anti-inflammatory drugs. Am J Med104:413-21 (1998) 
 
Prostaglandin G/H synthase 2
Name:Prostaglandin G/H synthase 2
Type:Enzyme
Mol. Mass.:69003.89
Organism:Homo sapiens (Human)
Description:Recombinant Cox-2 provided by Cayman (Cayman Chemical Co.,Ann Arbor, MI).
Residue:604
BDBM50016799
NameBDBM50016799
Synonyms:(1,8-Diethyl-1,3,4,9-tetrahydro-pyrano[3,4-b]indol-1-yl)-acetic acid AY-24236 ETODOLAC Lodine | Lodine xl
TypeSmall organic molecule
Emp. Form.C17H21NO3
Mol. Mass.287.3535
SMILESCCc1cccc2c3CCOC(CC)(CC(O)=O)c3[nH]c12