Reaction Details
TargetProstaglandin G/H synthase 2
LigandBDBM50029593
Substrate/Competitorn/a
Ki 920±n/a nM
CommentsPDSP_4470
Citation Cryer, BFeldman, M Cyclooxygenase-1 and cyclooxygenase-2 selectivity of widely used nonsteroidal anti-inflammatory drugs. Am J Med104:413-21 (1998) 
 
Prostaglandin G/H synthase 2
Name:Prostaglandin G/H synthase 2
Type:Enzyme
Mol. Mass.:69003.89
Organism:Homo sapiens (Human)
Description:Recombinant Cox-2 provided by Cayman (Cayman Chemical Co.,Ann Arbor, MI).
Residue:604
BDBM50029593
NameBDBM50029593
Synonyms:CHEMBL7162 N-(2-Cyclohexyloxy-4-nitro-phenyl)-methanesulfonamide N-[2-(cyclohexyloxy)-4-nitrophenyl]methane sulfonamide N-{2-(cyclohexyloxy)-4-[hydroxy(oxido)amino]phenyl}methanesulfonamide NS398
TypeSmall organic molecule
Emp. Form.C13H18N2O5S
Mol. Mass.314.357
SMILESCS(=O)(=O)Nc1ccc(cc1OC1CCCCC1)[N+]([O-])=O