Reaction Details
TargetProstaglandin G/H synthase 2
LigandBDBM50002861
Substrate/Competitorn/a
Ki>10000±n/a nM
CommentsPDSP_4485
Citation Cryer, BFeldman, M Cyclooxygenase-1 and cyclooxygenase-2 selectivity of widely used nonsteroidal anti-inflammatory drugs. Am J Med104:413-21 (1998) 
 
Prostaglandin G/H synthase 2
Name:Prostaglandin G/H synthase 2
Type:Enzyme
Mol. Mass.:69003.89
Organism:Homo sapiens (Human)
Description:Recombinant Cox-2 provided by Cayman (Cayman Chemical Co.,Ann Arbor, MI).
Residue:604
BDBM50002861
NameBDBM50002861
Synonyms:3-(4,5-Diphenyl-oxazol-2-yl)-propionic acid Daypro WY-21743 | oxaprosin
TypeSmall organic molecule
Emp. Form.C18H15NO3
Mol. Mass.293.3166
SMILESOC(=O)CCc1nc(c(o1)-c1ccccc1)-c1ccccc1