Reaction Details
TargetMelatonin receptor type 1A
LigandBDBM50043289
Substrate/Competitorn/a
Ki 1.86±n/a nM
CommentsPDSP_1195
Citation Nonno, RLucini, VPannacci, MMazzucchelli, CAngeloni, DFraschini, FStankov, BM Pharmacological characterization of the human melatonin Mel1a receptor following stable transfection into NIH3T3 cells. Br J Pharmacol124:485-92 (1998) 
 
Melatonin receptor type 1A
Name:Melatonin receptor type 1A
Type:Enzyme
Mol. Mass.:39392.94
Organism:Homo sapiens (Human)
Description:P48039
Residue:350
BDBM50043289
NameBDBM50043289
Synonyms:CHEMBL34730 N-[2-(6-Chloro-5-methoxy-1H-indol-3-yl)-ethyl]-acetamide(6-Chloromelatonin) | melatonin, 6-Chloro
TypeSmall organic molecule
Emp. Form.C13H15ClN2O2
Mol. Mass.266.723
SMILESCOc1cc2c(CCNC(C)=O)c[nH]c2cc1Cl