Reaction Details
TargetSomatostatin receptor type 1
LigandBDBM84629
Substrate/Competitorn/a
Ki 346.74±n/a nM
CommentsPDSP_385
Citation Siehler, SSeuwen, KHoyer, D [125I]Tyr10-cortistatin14 labels all five somatostatin receptors. Naunyn Schmiedebergs Arch Pharmacol357:483-9 (1998) 
 
Somatostatin receptor type 1
Name:Somatostatin receptor type 1
Type:Enzyme
Mol. Mass.:42692.81
Organism:Homo sapiens (Human)
Description:P30872
Residue:391
BDBM84629
NameBDBM84629
Synonyms:BIM 23056
TypeSmall organic molecule
Emp. Form.C71H81N11O9
Mol. Mass.1232.4711
SMILESCC(C)[C@H](NC(=O)[C@H](CCCCN)NC(=O)[C@@H](Cc1c[nH]c2ccccc12)NC(=O)[C@H](Cc1ccc(O)cc1)NC(=O)[C@H](Cc1ccccc1)NC(=O)[C@H](N)Cc1ccccc1)C(=O)N[C@@H](Cc1ccccc1)C(=O)N[C@H](Cc1cccc2ccccc12)C(N)=O