Reaction Details
TargetGlutamine synthetase
LigandBDBM85290
Substrate/Competitorn/a
Meas. Tech.Enzyme Assay
pH7±0
Ki 45±6 nM
Citation Johnson, RCBoettcher, BRCherpeck, REDolson, MG Design and Synthesis of Potent Inhibitors of Glutamine Synthetase Bioorg Chem18:154-9 (1990)  
 
Glutamine synthetase
Name:Glutamine synthetase
Type:Protein
Mol. Mass.:42066.51
Organism:Homo sapiens (Human)
Description:P15104
Residue:373
BDBM85290
NameBDBM85290
Synonyms:Phosphinothricin analog, 3 (L Isomer)
TypeSmall organic molecule
Emp. Form.C5H11NO5P
Mol. Mass.196.1189
SMILESCP(O)([O-])C(=O)CC([NH3+])C([O-])=O