Reaction Details
TargetGlutamine synthetase
LigandBDBM85293
Substrate/Competitorn/a
Meas. Tech.Enzyme Assay
pH7±0
Ki 5.0±1.5 nM
Citation Johnson, RCBoettcher, BRCherpeck, REDolson, MG Design and Synthesis of Potent Inhibitors of Glutamine Synthetase Bioorg Chem18:154-9 (1990)  
 
Glutamine synthetase
Name:Glutamine synthetase
Type:Protein
Mol. Mass.:42066.51
Organism:Homo sapiens (Human)
Description:P15104
Residue:373
BDBM85293
NameBDBM85293
Synonyms:Phosphinothricin analog, 6 (D,L Isomer)
TypeSmall organic molecule
Emp. Form.C6H11NO5P
Mol. Mass.208.1296
SMILESCP(O)([O-])C1=C[C@]([NH3+])(CO1)C([O-])=O