Reaction Details
TargetGlutamine--fructose-6-phosphate aminotransferase [isomerizing]
LigandBDBM85313
Substrate/Competitorn/a
Meas. Tech.Enzyme Assay
pH6.85±0
Ki 11000000±0.0 nM
IC50 25000000±0.0 nM
Citation Milewski, SHoffmann, MAndruszkiewicz, RBorowski, E Investigation of Mechanism of Nitrogen Transfer in Glucosamine 6-Phosphate Synthase with the Use of Transition State Analogs Bioorg Chem25:283-296 (1997)  
 
Glutamine--fructose-6-phosphate aminotransferase [isomerizing]
Name:Glutamine--fructose-6-phosphate aminotransferase [isomerizing]
Type:Enzyme
Mol. Mass.:79262.13
Organism:Candida albicans
Description:P53704
Residue:713
BDBM85313
NameBDBM85313
Synonyms:GlcN-6-P synthase inhibitor, 6 (racemic mixture)
TypeSmall organic molecule
Emp. Form.C6H15N2O4P
Mol. Mass.210.1681
SMILESCOC(=O)C(N)CCP(N)(=O)OC