Reaction Details
TargetSomatostatin receptor type 2
LigandBDBM82456
Substrate/Competitorn/a
Ki 13.18±n/a nM
CommentsPDSP_376
Citation Siehler, SSeuwen, KHoyer, D [125I][Tyr3]octreotide labels human somatostatin sst2 and sst5 receptors. Eur J Pharmacol348:311-20 (1998) 
 
Somatostatin receptor type 2
Name:Somatostatin receptor type 2
Type:Enzyme
Mol. Mass.:41344.94
Organism:Homo sapiens (Human)
Description:P30874
Residue:369
BDBM82456
NameBDBM82456
Synonyms:BIM 23030 | CAS_117580-24-2
TypeSmall organic molecule
Emp. Form.C45H57N9O8S2
Mol. Mass.916.12
SMILESCC(C)[C@@H]1NC(=O)[C@H](CCCCN)NC(=O)[C@@H](Cc2c[nH]c3ccccc23)NC(=O)[C@H](Cc2ccc(O)cc2)NC(=O)CCSSC(NC1=O)C(=O)N[C@@H](Cc1ccccc1)C(N)=O