Reaction Details
TargetSomatostatin receptor type 2
LigandBDBM82467
Substrate/Competitorn/a
Ki 1.12±n/a nM
CommentsPDSP_489
Citation Siehler, SSeuwen, KHoyer, D [125I][Tyr3]octreotide labels human somatostatin sst2 and sst5 receptors. Eur J Pharmacol348:311-20 (1998) 
 
Somatostatin receptor type 2
Name:Somatostatin receptor type 2
Type:Enzyme
Mol. Mass.:41344.94
Organism:Homo sapiens (Human)
Description:P30874
Residue:369
BDBM82467
NameBDBM82467
Synonyms:2-Deamino-L-Abu(1)-L-Lys-L-Asp(NH2)-L-Phe-L-Phe-L-Trp-L-Lys-L-Thr-L-Tyr-L-Thr-L-Ser-L-Abu(1)-OH CGP-23996
TypeSmall organic molecule
Emp. Form.C73H99N15O18
Mol. Mass.1474.6569
SMILESC[C@H](O)[C@@H]1NC(=O)C(CCCCN)NC(=O)[C@@H](Cc2c[nH]c3ccccc23)NC(=O)C(Cc2ccccc2)NC(=O)C(Cc2ccccc2)NC(=O)C(CC(N)=O)NC(=O)C(CCCCN)NC(=O)CCCCC[C@@H](NC(=O)[C@@H](CO)NC(=O)[C@H](NC(=O)[C@@H](Cc2ccc(O)cc2)NC1=O)[C@H](C)O)C(O)=O